{"text_format":"1","workbook":"xlsx","n_sheets":8,"sheets":["Cover Page","Value type","Health values","Environmental values","Social values","CPI adjustment","Notes","Version record"],"not_rendered":{"charts":0,"images":3,"macros":1,"external_links":0,"defined_names":8,"comments":0,"pivot_tables":0},"unopened":[],"bounds":{"document_bytes":16777216,"sheet_cells":100000,"rows_first":2000,"rows_last":500,"rows_between":2000,"halvings":0,"cell_chars":16384,"cell_head_chars":4096},"cells_cut":0,"cells_raw":0,"read":"whole","date_system":"1900"}

{"sheet":"Cover Page","index":0,"n_rows":54,"n_cols":2,"rows_kept":54,"cut":false,"hidden":false,"merged":[]}
[]
[]
[]
[null,"Value Tool for Natural Hazards: Database"]
[null,"Version 3.0, May 2021."]
[null,"Fiona L. Gibson, Abbie A. Rogers, Jacob I. Hawkins, David J. Pannell"]
{"$rows_left_out":49}
{"sheet":"Value type","index":1,"n_rows":46,"n_cols":2,"rows_kept":46,"cut":false,"hidden":false,"merged":[]}
["Value type","Final outcomes"]
["Health values"]
["Physical health","Change in the number of fatalities"]
[null,"Change in the number of serious injury, hospitalised injury and minor injury"]
[null,"Change in the number of illnesses or diseases"]
[null,"Change in pain to an individual"]
{"$rows_left_out":41}
{"sheet":"Health values","index":2,"n_rows":19,"n_cols":43,"rows_kept":19,"cut":false,"hidden":false,"merged":[]}
["STUDY IDENTIFICATION AND RELEVANCE",null,null,null,null,null,null,null,null,"WILLINGNESS TO PAY",null,null,null,null,null,null,null,null,null,null,null,null,null,null,null,"SAMPLE CHARACTERISTICS",null,null,null,null,null,null,null,"METHODS",null,null,null,"PUBLICATION CHARACTERISTICS"]
[]
["Observation ID\n(Identification number for every unique WTP observation)","Citation","Hazard types applicable","Value type applicable","Brief summary of study objective(s)","Study conducted in the context of a natural hazard?\n(Yes or No)","Study quality\n(1=high, 2=average, 3=poor)","Benefits transfer applicability\n(1=highly, 2=moderately, 3=rarely)","Recommendations \n(Applicability for benefit transfer in natural hazard context)","Definition of physical or marginal change\n(This is what is being measured, the value of the change in the outcome)","Hazard types identified","Specific value type measured","WTP estimate - original study value","WTP estimate - present value\n(2019 $AU)","Currency year - original study ","Currency - original study","WTP converted to $AU in original year from the study (used for calculating present value)","CPI ratio (used for calculating present value)","Other variables that significantly explain WTP (e.g. sample characteristics and survey attributes)","WTP measure","95% confidence interval: lower \n(If available; original study)","95% confidence interval: upper \n(If available; orginal study)","Standard Error\n(If available)","Standard deviation\n(If available)","p-values\n(If available)","Country/region studied","Country of source studies","Sampled population\n(The target population - e.g. this might be the whole population of the region, or it might be a specific subset of the whole population)","Range in years of data","Mean sample age\n(Measured in years)","% Male","Mean sample income","Income units\n(Units of measurement)","Data collection method used","Analysis model","Modelled number of individuals\n(Number of individuals reported for the regression)","Modelled number of observations\n(Number of observations reported for the regression)","Authors","Year published","Peer reviewed?\n(Yes or No)","Journal name","Additional notes","Full reference"]
[1,"Richardson, et al. 2013","Fire","Physical health","WTP for reduction in the number of illness symptom days due to bushfire smoke, California (contingent valuation approach)","Yes",1,2,"Useful for NH BT, especially fire context; be aware of/adjust for population differences","WTP for a reduction in an illness symptom day caused by wildfire smoke","Fire","Illness or disease","$95.03 per person per sympton day",{"$f":"Q4*R4","v":147.01648192771083},2009,"USD",118.24,{"$f":"INDEX('CPI adjustment'!$AG$18:$AG$41,MATCH(O4,'CPI adjustment'!$AF$18:$AF$41,0))","v":1.2433734939759036},"Education, pre-exisiting health condition, health insurance, location","Mean","22.78 [90 % confidence interval]","610.42 [90 % confidence interval]","n/a","n/a","n/a","Los Angeles County, California","USA","Duarte, Monrovia, Sierra Madre, Burbank, Glendora",2009,59.11,60,83520,"USD/year","Contingent valuation","Probit regression model",157,157,"Richardson, L., Loomis, J.B., Champ, P.A.",2013,"Yes","Land Economics","Paper compares traditional cost of illness valuation methods with defensive behavior and CVM WTPs. ","Richardson, L., Loomis, J.B., and P.A. Champ. 2013. Valuing Morbidity from Wildfire Smoke Exposure: A Comparison of Revealed and Stated Preference Techniques. Land Economics. 89 (1): 76-100"]
[2,"Richardson, et al. 2013","Fire","Physical health","WTP for reduction in the number of illness symptom days due to bushfire smoke, California (defensive behaviour approach)","Yes",1,2,"Useful for NH BT, especially fire context; be aware of/adjust for population differences","WTP for a reduction in an illness symptom day caused by wildfire smoke","Fire","Illness or disease","$86.87 per person per sympton day",{"$f":"Q5*R5","v":134.38380722891566},2009,"USD",108.08,{"$f":"INDEX('CPI adjustment'!$AG$18:$AG$41,MATCH(O5,'CPI adjustment'!$AF$18:$AF$41,0))","v":1.2433734939759036},"Smelled smoke, symptoms, gender, married, age, education, employment, location","Mean","76.56 [90 % confidence interval]","443.26 [90 % confidence interval]","n/a","n/a","n/a","Los Angeles County, California","USA","Duarte, Monrovia, Sierra Madre, Burbank, Glendora",2009,59.11,60,83520,"USD/year","Defensive behaviour model","Probit regression model",377,377,"Richardson, L., Loomis, J.B., Champ, P.A.",2013,"Yes","Land Economics","Paper compares traditional cost of illness valuation methods with defensive behavior and CVM WTPs. Paper utilizes a form of revealed preference method referred to as the 'defensive behaviour method' ","Richardson, L., Loomis, J.B., and P.A. Champ. 2013. Valuing Morbidity from Wildfire Smoke Exposure: A Comparison of Revealed and Stated Preference Techniques. Land Economics. 89 (1): 76-100"]
[3,"Access Economics 2008","Fire, Flood, Storm, Earthquake, Tsunami, Heatwave","Physical health","Meta-analysis of Value of Statistical Life studies from various countries","No",2,2,"Useful for BT with data drawn from a wide variety of locations, including Australia; be aware of generalised context - not NH specific","Aggregate WTP to avoid a life lost per event","Not specific to a natural hazard","Fatality","$6,036,000 per life",{"$f":"Q6*R6","v":7637924.795640327},2008,"AUD",6036000,{"$f":"INDEX('CPI adjustment'!$AG$18:$AG$41,MATCH(O6,'CPI adjustment'!$AF$18:$AF$41,0))","v":1.2653950953678474},"n/a","Mean",5361400,6710500,"n/a","n/a","<0.0001","n/a","n/a","n/a",">1980","n/a","n/a","n/a","n/a","Stated preference; Revealed preference","Meta-analysis random effects model","n/a",99,"Access Economics",2008,"No","n/a","The source studies and countries from the modelled studies were not specified in the report, however the full list of studies canvassed includes Australia, Austria, Canada, Denmark, Europe, France, Hong Kong, Japan, New Zealand, South Korea, Sweden, Switzerland, Taiwan, UK, US and other.","Access Economics, 2008. The health of nations: the value of a statistical life. Report prepared for the office of the Australian Safety and Compensation\nCouncil, Canberra."]
{"$rows_left_out":14}
{"sheet":"Environmental values","index":3,"n_rows":33,"n_cols":43,"rows_kept":33,"cut":false,"hidden":false,"merged":[]}
["STUDY IDENTIFICATION AND RELEVANCE",null,null,null,null,null,null,null,null,"WILLINGNESS TO PAY",null,null,null,null,null,null,null,null,null,null,null,null,null,null,null,"SAMPLE CHARACTERISTICS",null,null,null,null,null,null,null,"METHODS",null,null,null,"PUBLICATION CHARACTERISTICS"]
[]
["Observation ID\n(Identification number for every unique WTP observation)","Citation","Hazard types applicable ","Value type applicable","Brief summary of study objective(s)","Study conducted in the context of a natural hazard?\n(Yes or No)","Study quality\n(1=high, 2=average, 3=poor)","Benefits transfer applicability\n(1=highly, 2=moderately, 3=rarely)","Recommendations  \n(Applicability for benefit transfer in natural hazard context)","Definition of physical or marginal change\n(This is what is being measured, the value of the change in the outcome)","Hazard types identified","Specific value type measured","WTP estimate - original study value","WTP estimate - present value\n(2019 $AU)","Currency year - original study ","Currency - original study","WTP converted to $AU in original year from the study (used for calculating present value)","CPI ratio (used for calculating present value)","Other variables that significantly explain WTP (e.g. sample characteristics and survey attributes)","WTP measure","95% confidence interval: lower \n(If available; original study)","95% confidence interval: upper \n(If available; orginal study)","Standard Error\n(If available)","Standard deviation\n(If available)","p-values\n(If available)","Country/region studied","Country of source studies","Sampled population\n(The target population - e.g. this might be the whole population of the region, or it might be a specific subset of the whole population)","Range in years of data","Mean sample age\n(Measured in years)","% Male","Mean sample income","Income units\n(Units of measurement)","Data collection method used","Analysis model","Modelled number of individuals\n(Number of individuals reported for the regression)","Modelled number of observations\n(Number of observations reported for the regression)","Authors","Year published","Peer reviewed?\n(Yes or No)","Journal name","Additional notes","Full reference"]
[1,"Akter, et al. 2015","Fire, Flood, Storm, Earthquake, Tsunami, Heatwave","Ecosystems","WTP to protect endangered species from invasive species (feral animals, insects and weeds).","No",1,2,"Useful for BT where NH leads to increased impact from invasive species","WTP per endangered species protected per household per year","Invasive species","Endangered species","$47.00 per species per household per year",{"$f":"Q4*R4","v":50.677501741351278},2015,"AUD",47,{"$f":"INDEX('CPI adjustment'!$AG$18:$AG$41,MATCH(O4,'CPI adjustment'!$AF$18:$AF$41,0))","v":1.078244717901091},"Education, income, age, prior experience and attitude with biosecurity, invasive weeds, invasive insects, cost","Mean",26,68,"n/a","n/a","n/a","Queensland; New South Wales; Victoria","Australia","Queensland; New South Wales; Victoria","2010-2011","49 (NSW), 48 (QLD), 44 (VIC)","62% (NSW), 56% (QLD), 44% (VIC)","$1,153 (NSW), $1,250 (QLD), $1,250 (VIC)","AUD","Choice modeling","Latent class logit model","n/a",2402,"Akter, S., Kompas, T., Ward, M.B.",2015,"Yes","Ecological Ecconomics","Paper includes mean implicit values for species (but do not specify what species).","Akter, S., Kompas, T., and M.B. Ward. 2015. Application of portfolio theory to asset-based biosecurity decision analysis. Ecological Economics. 117 (2015):73-85."]
[2,"Hatton MacDonald, et al. 2011","Fire, Flood, Storm, Earthquake, Tsunami, Heatwave","Ecosystems","WTP for an increase in the frequency of waterbird breeding events ","No",1,2,"Useful for BT in Australia; be aware of generalised context - not NH specific","WTP for a 1 year increase to the frequency of waterbird breeding events per household per year (max. 10 years)","Drought, climate change","Species","$13.64 per 1 year increase in breeding frequency per household per year",{"$f":"Q5*R5","v":16.959614457831325},2009,"AUD",13.64,{"$f":"INDEX('CPI adjustment'!$AG$18:$AG$41,MATCH(O5,'CPI adjustment'!$AF$18:$AF$41,0))","v":1.2433734939759036},"Water bird breeding, cost, healthy vegetation, native fish, age, gender, environmental attitudes","Mean",10.95,16.47,null,null,null,"Murray River, Australia","Australia","New South Wales","2008-2009",47.6,0.44699999999999995,"n/a","n/a","Choice modeling","Panel multinomial logit error components","n/a",11644,"MacDonald, D.H., Morrison, M.D., Rose, J.M., and Boyle, K.J.",2011,"Yes","Australian Journal of Agriculture and Resource Economics","Colonial waterbird breeding now occurs in some wetlands along the Murray one in every 10 years. The levels presented to survey respondents are improvement to the 1 in 10 frequency. Respondents were told each option has an annual household cost that will be paid each year for a 10-year period through increased taxes and higher prices for food.","Hatton MacDonald, D., Morrison, M.D., Rose, J.M., and Boyle, K.J. 2011. Valuing a multistate river: the case of the River Murray. AJARE. 55: 374-392."]
[3,"Hatton MacDonald, et al. 2011","Fire, Flood, Storm, Earthquake, Tsunami, Heatwave","Ecosystems","WTP for improvements in environmental quality on River Murray for respondents from ACT","No",1,2,"Useful for BT in Australia; be aware of generalised context - not NH specific","WTP for a 1 year increase to the frequency of waterbird breeding events per household per year (max. 10 years)","Drought, climate change","Species","$15.99 per 1 year increase in breeding frequency per household per year",{"$f":"Q6*R6","v":19.881542168674699},2009,"AUD",15.99,{"$f":"INDEX('CPI adjustment'!$AG$18:$AG$41,MATCH(O6,'CPI adjustment'!$AF$18:$AF$41,0))","v":1.2433734939759036},"Waterbird breeding, cost, waterbird habitat, native fish","Mean",10.49,21.89,null,null,null,"Murray River, Australia","Australia","Australian Capital Territory","2008-2009",47.9,0.48099999999999998,"n/a","n/a","Choice modeling","Panel multinomial logit error components","n/a",11644,"MacDonald, D.H., Morrison, M.D., Rose, J.M., and Boyle, K.J.",2011,"Yes","Australian Journal of Agriculture and Resource Economics","Colonial waterbird breeding now occurs in some wetlands along the Murray one in every 10 years. The levels presented to survey respondents are improvement to the 1 in 10 frequency. Respondents were told each option has an annual household cost that will be paid each year for a 10-year period through increased taxes and higher prices for food.","Hatton MacDonald, D., Morrison, M.D., Rose, J.M., and Boyle, K.J. 2011. Valuing a multistate river: the case of the River Murray. AJARE. 55: 374-392."]
{"$rows_left_out":28}
{"sheet":"Social values","index":4,"n_rows":37,"n_cols":43,"rows_kept":37,"cut":false,"hidden":false,"merged":[]}
["STUDY IDENTIFICATION AND RELEVANCE",null,null,null,null,null,null,null,null,"WILLINGNESS TO PAY",null,null,null,null,null,null,null,null,null,null,null,null,null,null,null,"SAMPLE CHARACTERISTICS",null,null,null,null,null,null,null,"METHODS",null,null,null,"PUBLICATION CHARACTERISTICS"]
[]
["Observation ID\n(Identification number for every unique WTP observation)","Citation","Hazard types applicable","Value type applicable","Brief summary of study objective(s)","Study conducted in the context of a natural hazard?\n(Yes or No)","Study quality\n(1=high, 2=average, 3=poor)","Benefits transfer applicability\n(1=highly, 2=moderately, 3=rarely)","Recommendations \n(Applicability for benefit transfer in natural hazard context)","Definition of physical or marginal change\n(This is what is being measured, the value of the change in the outcome)","Hazard types identified","Specific value type measured","WTP estimate - original study value","WTP estimate - present value\n(2019 $AU)","Currency year - original study ","Currency - original study","WTP converted to $AU in original year from the study (used for calculating present value)","CPI ratio (used for calculating present value)","Other variables that significantly explain WTP (e.g. sample characteristics and survey attributes)","WTP measure","95% confidence interval: lower \n(If available; original study)","95% confidence interval: upper \n(If available; orginal study)","Standard Error\n(If available)","Standard deviation\n(If available)","p-values\n(If available)","Country/region studied","Country of source studies","Sampled population\n(The target population - e.g. this might be the whole population of the region, or it might be a specific subset of the whole population)","Range in years of data","Mean sample age\n(Measured in years)","% Male","Mean sample income","Income units\n(Units of measurement)","Data collection method used","Analysis model","Modelled number of individuals\n(Number of individuals reported for the regression)","Modelled number of observations\n(Number of observations reported for the regression)","Authors","Year published","Peer reviewed?\n(Yes or No)","Journal name","Additional notes","Full reference"]
[1,"Rolfe and Windle 2003","Fire, Flood, Storm, Earthquake, Tsunami, Heatwave","Cultural heritage","WTP for the protection of Aboriginal cultural heritage sites among Indigenous and non-Indigenous communities","No",1,3,"Limited application; not NH specific","WTP per household per year for a 1% change in Aboriginal cultural heritage sites protected","Human activity","Indigenous heritage significance","$3.22 per 27 sites protected person per year",{"$f":"Q4*R4","v":4.9675376884422109},2001,"AUD",3.22,{"$f":"INDEX('CPI adjustment'!$AC$18:$AC$38,MATCH(O4,'CPI adjustment'!$AB$18:$AB$38,0))","v":1.5427135678391959},"Other attributes (cost, waterways, cultural heritage, reserve), understanding of the survey, gender, children, environmental organization, income, age","Part-worth ",1.89,5.43,"n/a","n/a","n/a","Central Queensland","Australia","Indigenous persons, Rockhampton",2001,38,41,42062,"AUD/year","Choice modeling","Multinomial logit model","n/a",496,"Rolfe, J., Windle, J.",2003,"Yes","The Economic Record","Using the best information available, 2724 Aboriginal cultural heritage places are currently recorded in the Fitzroy Basin. 30% of the sample had an education beyond year 12. Indigenous population that was sampled preferred more cultural heritage sites to be protected. Note that this cited paper also contains WTP data for two other population samples: Rockhampton (non-indigenous) and Brisbane. Those values have been omitted from the Value Tool as they require additional interpretation beyond what can be accommodated in this tool. The reported WTP estimates were -$3.22 and -$2.08 per 27 sites protected per person per year (27 sites = 1% of total sites protected), for Rockhampton and Brisbane, respectively. However, this reflects that both of these samples had a positive WTP for a 10% or 20% increase in protection of cultural heritage sites relative to base levels, but that an increase in protection to 30% was a major disincentive on choice, leading to an average negative WTP per % increase in protection overall. This should be interpreted as a non-linear preference for protecting cultural heritage sites, with a modest increase in protection being positively valued. Readers should refer to the full paper for a thorough description.","Rolfe, J. and Windle, J. Valuing the Protection of Aboriginal Cultural Heritage Sites. 2003. The Economic Record. 79(2003): 85-95"]
[2,"Landry, et al. 2007","Fire, Flood, Storm, Earthquake, Tsunami","Social disruption","WTP for a sample of relatively poor households to return home after Hurricane Katrina.","Yes",1,2,"Useful for NH BT, especially flood context; be aware of/adjust for population differences","WTP per person to return home, per year away from home","Flood, Storm","Displaced people","$3,954 per person per year",{"$f":"Q5*R5","v":7299.5872371196147},2005,"USD",5216.91,{"$f":"INDEX('CPI adjustment'!$AG$18:$AG$41,MATCH(O5,'CPI adjustment'!$AF$18:$AF$41,0))","v":1.3992166315155168},"Income, age, residence located in New Orleans Metropolitan Area, born in county residence","Mean",3651,4692,"n/a","n/a","n/a","New Orleans","USA","Evacuees, Houston","2005-2006","n/a",0.51,18704,"USD/year","Stated preference","Logistic regression model","n/a",746,"Landry, C.E., Bin, O., Hindsley, P., Whitehead, J.C., Wilson, K.",2007,"Yes","Southern Economic Journal","Paper results indicated that the average individual is willing to sacrifice $1.94 (2005 USD) per hour in higher wages to return home. The estimate listed aggregates this to an annual WTP, based on average hours worked.","Landry, C.E., Bin, O., Hindsley, P., Whitehead, J.C., Wilson, K. 2007. Going Home: Evacuation-Migration Decisions of Hurrican Katrina Survivors. Southern Economic Journal. 74(2): 326-343"]
[3,"Li et al. 2010","Fire, Flood, Storm, Earthquake, Tsunami, Heatwave","Social disruption","WTP to avoid a delay in commuter arrival, in the context of Australian toll roads.","No",2,2,"Useful for BT in Australia; be aware of generalised context - not NH specific","WTP per person per trip to avoid an hour late arrival","Not specified","Moveability","$38.86 per person per hour per trip",49.173253405994551,2008,"AUD",38.86,{"$f":"INDEX('CPI adjustment'!$AG$18:$AG$41,MATCH(O6,'CPI adjustment'!$AF$18:$AF$41,0))","v":1.2653950953678474},"n/a","Mean","n/a","n/a","n/a",2.52,"n/a","Australia","Australia","Commuters",2008,"n/a","n/a","n/a","n/a","Choice modeling","Mixed multinomial logit","n/a",4496,"Li, Z., Hensher, D.A, Rose, J.M",2010,"Yes","Transportation Research Part E","n/a","Li, Z., Hensher, D.A., Rose, J.M. 2010. Willingness to pay for travel time reliability in passenger transport: A review and some new empirical evidence. Transportation Research Part E. 46: 384–403."]
{"$rows_left_out":32}
{"sheet":"CPI adjustment","index":5,"n_rows":107,"n_cols":33,"rows_kept":107,"cut":false,"hidden":false,"merged":[]}
["Source","https://www.rba.gov.au/calculator/annualDecimal.html"]
[]
[null,null,"Calculation of present values for WTP",null,null,null,null,null,null,null,null,null,null,null,null,null,null,"If you need to assess a restrospective policy or decision, you can do so using the following formula:"]
[null,null,"Column Q in the value tab sheets provides the WTP estimate in Australian dollars for the year the study was conducted",null,null,null,null,null,null,null,null,null,null,null,null,null,null,"CPI ratio = index value for policy year from column N / index value for study year from column N"]
[null,null,"  (calculated using historical exchange rates from the RBA, with the rate taken from 1st July for that year or closest possible date). ",null,null,null,null,null,null,null,null,null,null,null,null,null,null,"E.g. If you need a ratio for a policy decision in 2014, for a study estimate in the database from 2005:"]
[null,null,"Column R in the value tab sheets provides the CPI ratio, as calculated in column U of this sheet.",null,null,null,null,null,null,null,null,null,null,null,null,null,null,"CPI ratio = 106.075/82.975 = 1.278"]
{"$rows_left_out":102}
{"sheet":"Notes","index":6,"n_rows":33,"n_cols":3,"rows_kept":33,"cut":false,"hidden":false,"merged":[]}
[]
[]
[]
[]
[null,"Acronyms:"]
[null,"WTP","willingness to pay"]
{"$rows_left_out":28}
{"sheet":"Version record","index":7,"n_rows":33,"n_cols":4,"rows_kept":33,"cut":false,"hidden":false,"merged":[]}
[]
[null,"This sheet contains a record of variations made between version releases"]
[]
[null,"Version 2.0 release:"]
[null,"1.","2019 CPI data added."]
[null,"2.","Current value estimates in value tab sheets updated to 2019AUD (in Version 1.0, 2017AUD)."]
{"$rows_left_out":27}